# Add compile files('C:/Users/Administrator/Desktop/chardet.jar') in build.gradle of core and exception happens

**URL:** <https://discuss.elastic.co/t/add-compile-files-c-users-administrator-desktop-chardet-jar-in-build-gradle-of-core-and-exception-happens/84549>\
**Category:** Elasticsearch\
**Created:** [May 4, 2017, 11:49am UTC](https://discuss.elastic.co/t/add-compile-files-c-users-administrator-desktop-chardet-jar-in-build-gradle-of-core-and-exception-happens/84549 "2017-05-04T11:49:20Z")\
**Posts on this page:** 3\
**Page:** 1

<div class="post-metadata">

**Author:** ![makeyang](https://avatars.discourse-cdn.com/v4/letter/m/f05b48/32.png) [@makeyang](https://discuss.elastic.co/u/makeyang)\
**Post date:** [May 4, 2017, 11:49am UTC](https://discuss.elastic.co/t/add-compile-files-c-users-administrator-desktop-chardet-jar-in-build-gradle-of-core-and-exception-happens/84549/1 "2017-05-04T11:49:20Z")

</div>

org.gradle.api.GradleScriptException: A problem occurred evaluating project ':core'.  
at org.gradle.groovy.scripts.internal.DefaultScriptRunnerFactory$ScriptRunnerImpl.run(DefaultScriptRunnerFactory.java:92)  
at org.gradle.configuration.DefaultScriptPluginFactory$ScriptPluginImpl$2.run(DefaultScriptPluginFactory.java:176)  
at org.gradle.configuration.ProjectScriptTarget.addConfiguration(ProjectScriptTarget.java:77)  
at org.gradle.configuration.DefaultScriptPluginFactory$ScriptPluginImpl.apply(DefaultScriptPluginFactory.java:181)  
at org.gradle.configuration.project.BuildScriptProcessor.execute(BuildScriptProcessor.java:39)  
at org.gradle.configuration.project.BuildScriptProcessor.execute(BuildScriptProcessor.java:26)  
at org.gradle.configuration.project.ConfigureActionsProjectEvaluator.evaluate(ConfigureActionsProjectEvaluator.java:34)  
at org.gradle.configuration.project.LifecycleProjectEvaluator.doConfigure(LifecycleProjectEvaluator.java:70)  
at org.gradle.configuration.project.LifecycleProjectEvaluator.access$000(LifecycleProjectEvaluator.java:33)  
at org.gradle.configuration.project.LifecycleProjectEvaluator$1.execute(LifecycleProjectEvaluator.java:53)  
at org.gradle.configuration.project.LifecycleProjectEvaluator$1.execute(LifecycleProjectEvaluator.java:50)  
at org.gradle.internal.Transformers$4.transform(Transformers.java:169)  
at org.gradle.internal.progress.DefaultBuildOperationExecutor.run(DefaultBuildOperationExecutor.java:106)  
at org.gradle.internal.progress.DefaultBuildOperationExecutor.run(DefaultBuildOperationExecutor.java:61)  
at org.gradle.configuration.project.LifecycleProjectEvaluator.evaluate(LifecycleProjectEvaluator.java:50)  
at org.gradle.api.internal.project.DefaultProject.evaluate(DefaultProject.java:648)  
at org.gradle.api.internal.project.DefaultProject.evaluate(DefaultProject.java:126)  
at org.gradle.execution.TaskPathProjectEvaluator.configure(TaskPathProjectEvaluator.java:35)  
at org.gradle.execution.TaskPathProjectEvaluator.configureHierarchy(TaskPathProjectEvaluator.java:62)  
at org.gradle.configuration.DefaultBuildConfigurer.configure(DefaultBuildConfigurer.java:38)  
at org.gradle.initialization.DefaultGradleLauncher$ConfigureBuildAction.execute(DefaultGradleLauncher.java:207)  
at org.gradle.initialization.DefaultGradleLauncher$ConfigureBuildAction.execute(DefaultGradleLauncher.java:204)  
at org.gradle.internal.Transformers$4.transform(Transformers.java:169)  
at org.gradle.internal.progress.DefaultBuildOperationExecutor.run(DefaultBuildOperationExecutor.java:106)  
at org.gradle.internal.progress.DefaultBuildOperationExecutor.run(DefaultBuildOperationExecutor.java:56)  
at org.gradle.initialization.DefaultGradleLauncher.doBuildStages(DefaultGradleLauncher.java:146)  
at org.gradle.initialization.DefaultGradleLauncher.doBuild(DefaultGradleLauncher.java:112)  
at org.gradle.initialization.DefaultGradleLauncher.run(DefaultGradleLauncher.java:95)  
at org.gradle.launcher.exec.GradleBuildController.run(GradleBuildController.java:66)  
at org.gradle.tooling.internal.provider.ExecuteBuildActionRunner.run(ExecuteBuildActionRunner.java:28)  
at org.gradle.launcher.exec.ChainingBuildActionRunner.run(ChainingBuildActionRunner.java:35)  
at org.gradle.launcher.exec.InProcessBuildActionExecuter.execute(InProcessBuildActionExecuter.java:41)  
at org.gradle.launcher.exec.InProcessBuildActionExecuter.execute(InProcessBuildActionExecuter.java:26)  
at org.gradle.tooling.internal.provider.ContinuousBuildActionExecuter.execute(ContinuousBuildActionExecuter.java:75)  
at org.gradle.tooling.internal.provider.ContinuousBuildActionExecuter.execute(ContinuousBuildActionExecuter.java:49)  
at org.gradle.tooling.internal.provider.ServicesSetupBuildActionExecuter.execute(ServicesSetupBuildActionExecuter.java:49)  
at org.gradle.tooling.internal.provider.ServicesSetupBuildActionExecuter.execute(ServicesSetupBuildActionExecuter.java:31)  
at org.gradle.launcher.cli.RunBuildAction.run(RunBuildAction.java:51)  
at org.gradle.internal.Actions$RunnableActionAdapter.execute(Actions.java:173)  
at org.gradle.launcher.cli.CommandLineActionFactory$ParseAndBuildAction.execute(CommandLineActionFactory.java:281)  
at org.gradle.launcher.cli.CommandLineActionFactory$ParseAndBuildAction.execute(CommandLineActionFactory.java:254)  
at org.gradle.launcher.cli.JavaRuntimeValidationAction.execute(JavaRuntimeValidationAction.java:33)  
at org.gradle.launcher.cli.JavaRuntimeValidationAction.execute(JavaRuntimeValidationAction.java:24)  
at org.gradle.launcher.cli.ExceptionReportingAction.execute(ExceptionReportingAction.java:33)  
at org.gradle.launcher.cli.ExceptionReportingAction.execute(ExceptionReportingAction.java:22)  
at org.gradle.launcher.cli.CommandLineActionFactory$WithLogging.execute(CommandLineActionFactory.java:247)  
at org.gradle.launcher.cli.CommandLineActionFactory$WithLogging.execute(CommandLineActionFactory.java:182)  
at org.gradle.launcher.Main.doAction(Main.java:33)  
at org.gradle.launcher.bootstrap.EntryPoint.run(EntryPoint.java:45)  
at org.gradle.launcher.bootstrap.ProcessBootstrap.runNoExit(ProcessBootstrap.java:60)  
at org.gradle.launcher.bootstrap.ProcessBootstrap.run(ProcessBootstrap.java:37)  
at org.gradle.launcher.GradleMain.main(GradleMain.java:23)

how to fix this?

---

<div class="post-metadata">

**Author:** ![makeyang](https://avatars.discourse-cdn.com/v4/letter/m/f05b48/32.png) [@makeyang](https://discuss.elastic.co/u/makeyang)\
**Post date:** [May 4, 2017, 11:50am UTC](https://discuss.elastic.co/t/add-compile-files-c-users-administrator-desktop-chardet-jar-in-build-gradle-of-core-and-exception-happens/84549/2 "2017-05-04T11:50:03Z")

</div>

this is the blow exception since it is over length. so I split it into 2 talks  
Caused by: org.gradle.api.InvalidActionClosureException: The closure 'org.elasticsearch.gradle.BuildPlugin$\_configureConfigurations\_closure3@227c0cf7' is not valid as an action for argument 'org.gradle.api.internal.artifacts.dependencies.DefaultSelfResolvingDependency\_Decorated@433edba9'. It should accept no parameters, or one compatible with type 'org.gradle.api.internal.artifacts.dependencies.DefaultSelfResolvingDependency\_Decorated'. It accepts (org.gradle.api.artifacts.ModuleDependency).  
at org.gradle.api.internal.ClosureBackedAction.execute(ClosureBackedAction.java:76)  
at org.gradle.util.ConfigureUtil.configureTarget(ConfigureUtil.java:160)  
at org.gradle.util.ConfigureUtil.configure(ConfigureUtil.java:106)  
at org.gradle.util.ConfigureUtil$1.execute(ConfigureUtil.java:123)  
at org.gradle.internal.ImmutableActionSet$CompositeSet.execute(ImmutableActionSet.java:196)  
at org.gradle.internal.MutableActionSet.execute(MutableActionSet.java:35)  
at org.gradle.api.internal.DefaultDomainObjectCollection.doAdd(DefaultDomainObjectCollection.java:204)  
at org.gradle.api.internal.DefaultDomainObjectCollection.add(DefaultDomainObjectCollection.java:198)  
at org.gradle.api.internal.DelegatingDomainObjectSet.add(DelegatingDomainObjectSet.java:82)  
at org.gradle.api.internal.artifacts.dsl.dependencies.DefaultDependencyHandler.doAdd(DefaultDependencyHandler.java:119)  
at org.gradle.api.internal.artifacts.dsl.dependencies.DefaultDependencyHandler.access$300(DefaultDependencyHandler.java:46)  
at org.gradle.api.internal.artifacts.dsl.dependencies.DefaultDependencyHandler$DynamicMethods.invokeMethod(DefaultDependencyHandler.java:217)  
at org.gradle.internal.metaobject.BeanDynamicObject$MetaClassAdapter.invokeMethod(BeanDynamicObject.java:483)  
at org.gradle.internal.metaobject.BeanDynamicObject.invokeMethod(BeanDynamicObject.java:176)  
at org.gradle.internal.metaobject.CompositeDynamicObject.invokeMethod(CompositeDynamicObject.java:96)  
at org.gradle.internal.metaobject.MixInClosurePropertiesAsMethodsDynamicObject.invokeMethod(MixInClosurePropertiesAsMethodsDynamicObject.java:30)  
at org.gradle.internal.metaobject.ConfigureDelegate.invokeMethod(ConfigureDelegate.java:59)  
at build\_40gv996bbs8um38zc206lc1r5$\_run\_closure2.doCall(/home/majun/IdeaProjects/elasticsearch-5.3.0/core/build.gradle:99)  
at org.gradle.api.internal.ClosureBackedAction.execute(ClosureBackedAction.java:71)  
at org.gradle.util.ConfigureUtil.configureTarget(ConfigureUtil.java:160)  
at org.gradle.util.ConfigureUtil.configure(ConfigureUtil.java:106)  
at org.gradle.api.internal.project.DefaultProject.dependencies(DefaultProject.java:1111)  
at org.gradle.internal.metaobject.BeanDynamicObject$MetaClassAdapter.invokeMethod(BeanDynamicObject.java:464)  
at org.gradle.internal.metaobject.BeanDynamicObject.invokeMethod(BeanDynamicObject.java:176)  
at org.gradle.internal.metaobject.CompositeDynamicObject.invokeMethod(CompositeDynamicObject.java:96)  
at org.gradle.internal.metaobject.MixInClosurePropertiesAsMethodsDynamicObject.invokeMethod(MixInClosurePropertiesAsMethodsDynamicObject.java:30)  
at org.gradle.groovy.scripts.BasicScript.invokeMethod(BasicScript.java:107)  
at org.gradle.groovy.scripts.BasicScript.methodMissing(BasicScript.java:116)  
at build\_40gv996bbs8um38zc206lc1r5.run(/home/majun/IdeaProjects/elasticsearch-5.3.0/core/build.gradle:39)  
at org.gradle.groovy.scripts.internal.DefaultScriptRunnerFactory$ScriptRunnerImpl.run(DefaultScriptRunnerFactory.java:90)  
... 51 more

BUILD FAILED

---

<div class="post-metadata">

**Author:** ![system](https://us1.discourse-cdn.com/elastic/original/3X/1/a/1ac57faf039f6b580b3f104ef42a2a89e41014de.png) [@system](https://discuss.elastic.co/u/system)\
**Post date:** [June 1, 2017, 12:02pm UTC](https://discuss.elastic.co/t/add-compile-files-c-users-administrator-desktop-chardet-jar-in-build-gradle-of-core-and-exception-happens/84549/3 "2017-06-01T12:02:37Z")

</div>

This topic was automatically closed 28 days after the last reply. New replies are no longer allowed.
