# \[ES Gradle Tasks\] Could not find method nebula() for arguments

**URL:** <https://discuss.elastic.co/t/es-gradle-tasks-could-not-find-method-nebula-for-arguments/197719>\
**Category:** Elasticsearch\
**Created:** [September 2, 2019, 4:50pm UTC](https://discuss.elastic.co/t/es-gradle-tasks-could-not-find-method-nebula-for-arguments/197719 "2019-09-02T16:50:54Z")\
**Posts on this page:** 2\
**Page:** 1

<div class="post-metadata">

**Author:** ![varundbest](https://sea2.discourse-cdn.com/elastic/user_avatar/discuss.elastic.co/varundbest/32/48066_2.png) [@varundbest](https://discuss.elastic.co/u/varundbest)\
**Post date:** [September 2, 2019, 4:50pm UTC](https://discuss.elastic.co/t/es-gradle-tasks-could-not-find-method-nebula-for-arguments/197719/1 "2019-09-02T16:50:54Z")

</div>

`./gradlew -version`

```auto
------------------------------------------------------------
Gradle 5.5
------------------------------------------------------------

Build time: 2019-06-28 17:36:05 UTC
Revision: 83820928f3ada1a3a1dbd9a6c0d47eb3f199378f

Kotlin: 1.3.31
Groovy: 2.5.4
Ant: Apache Ant(TM) version 1.9.14 compiled on March 12 2019
JVM: 12.0.2 (Private Build 12.0.2+9-Ubuntu-118.04)
OS: Linux 4.15.0-58-generic amd64

```

So, I'm unable to run Elasticsearch gradle tasks anymore due to the above mentioned error. For Example:  
`./gradlew -p docs check --stacktrace`

Returns:

```auto

FAILURE: Build failed with an exception.

* What went wrong:
A problem occurred configuring project ':client:client-benchmark-noop-api-plugin'.
> Could not find method nebula() for arguments [interface org.gradle.api.publish.maven.MavenPublication] on Publication container of type org.gradle.api.publish.internal.DefaultPublicationContainer.

* Try:
Run with --info or --debug option to get more log output. Run with --scan to get full insights.

* Exception is:
org.gradle.api.ProjectConfigurationException: A problem occurred configuring project ':client:client-benchmark-noop-api-plugin'.
        at org.gradle.configuration.project.LifecycleProjectEvaluator.wrapException(LifecycleProjectEvaluator.java:79)
        at org.gradle.configuration.project.LifecycleProjectEvaluator.addConfigurationFailure(LifecycleProjectEvaluator.java:72)
        at org.gradle.configuration.project.LifecycleProjectEvaluator.access$600(LifecycleProjectEvaluator.java:53)
        at org.gradle.configuration.project.LifecycleProjectEvaluator$NotifyAfterEvaluate.run(LifecycleProjectEvaluator.java:198)
        at org.gradle.internal.operations.DefaultBuildOperationExecutor$RunnableBuildOperationWorker.execute(DefaultBuildOperationExecutor.java:402)
        at org.gradle.internal.operations.DefaultBuildOperationExecutor$RunnableBuildOperationWorker.execute(DefaultBuildOperationExecutor.java:394)
        at org.gradle.internal.operations.DefaultBuildOperationExecutor$1.execute(DefaultBuildOperationExecutor.java:165)
        at org.gradle.internal.operations.DefaultBuildOperationExecutor.execute(DefaultBuildOperationExecutor.java:250)
        at ...... (Reached discourse forum limit)

```

Similar with `./gradlew idea`:

```auto
FAILURE: Build failed with an exception.

* What went wrong:
A problem occurred configuring project ':client:client-benchmark-noop-api-plugin'.
> Could not find method nebula() for arguments [interface org.gradle.api.publish.maven.MavenPublication] on Publication container of type org.gradle.api.publish.internal.DefaultPublicationContainer.

* Try:
Run with --stacktrace option to get the stack trace. Run with --info or --debug option to get more log output. Run with --scan to get full insights.

```

---

<div class="post-metadata">

**Author:** ![system](https://us1.discourse-cdn.com/elastic/original/3X/1/a/1ac57faf039f6b580b3f104ef42a2a89e41014de.png) [@system](https://discuss.elastic.co/u/system)\
**Post date:** [September 30, 2019, 4:50pm UTC](https://discuss.elastic.co/t/es-gradle-tasks-could-not-find-method-nebula-for-arguments/197719/2 "2019-09-30T16:50:57Z")

</div>

This topic was automatically closed 28 days after the last reply. New replies are no longer allowed.
