# Failed to pass the test from pyes

**URL:** <https://discuss.elastic.co/t/failed-to-pass-the-test-from-pyes/6237>\
**Category:** Elasticsearch\
**Created:** [December 26, 2011, 7:08am UTC](https://discuss.elastic.co/t/failed-to-pass-the-test-from-pyes/6237 "2011-12-26T07:08:42Z")\
**Posts on this page:** 5\
**Page:** 1

<div class="post-metadata">

**Author:** ![Kerui\_Min](https://avatars.discourse-cdn.com/v4/letter/k/ee59a6/32.png) [@Kerui\_Min](https://discuss.elastic.co/u/Kerui_Min)\
**Post date:** [December 26, 2011, 7:08am UTC](https://discuss.elastic.co/t/failed-to-pass-the-test-from-pyes/6237/1 "2011-12-26T07:08:42Z")

</div>

Hi all,

I have some problem to start working on the elasticsearch. I  
downloaded the latest version from the website, and download pyes 0.16  
as the connector. Everything looks fine, but somehow it failed to pass  
the test pyes/tests/indexing.py. Here is the output from indexing.py:

# .............F.

## FAIL: testMLT ( **main**.IndexingTestCase)

Traceback (most recent call last):  
File "indexing.py", line 141, in testMLT  
self.assertResultContains(result, {u'\_shards': {u'successful': 5,  
0, u'total': 5}})  
File "C:\Python27\lib\site-packages\pyes-0.16.0-py2.7.egg\pyes\tests  
py", line 24, in assertResultContains  
self.assertEquals(value, result[key])  
AssertionError: {u'successful': 5, u'failed': 0, u'total': 5} != {u'su  
1, u'failed': 0, u'total': 1}

- {u'failed': 0, u'successful': 5, u'total': 5}  
? ^ ^

- {u'failed': 0, u'successful': 1, u'total': 1}  
? ^ ^

* * *

Ran 15 tests in 9.806s

FAILED (failures=1)

On the other hand, here is the error message raised by the  
elasticsearch server:

[2011-12-26 15:03:51,756][DEBUG][action.admin.indices.refresh]  
[Aardwolf] [anoth  
er-index][3], node[72m8MJXiRy-oyetVL2Iz\_w], [P], s[INITIALIZING]:  
Failed to exec  
ute  
[org.elasticsearch.action.admin.indices.refresh.RefreshRequest@1c38ba8f]  
org.elasticsearch.index.IndexShardMissingException: [another-index][3]  
missing  
at  
org.elasticsearch.index.service.InternalIndexService.shardSafe(Intern  
alIndexService.java:177)  
at  
org.elasticsearch.action.admin.indices.refresh.TransportRefreshAction  
.shardOperation(TransportRefreshAction.java:128)  
at  
org.elasticsearch.action.admin.indices.refresh.TransportRefreshAction  
.shardOperation(TransportRefreshAction.java:53)  
at  
org.elasticsearch.action.support.broadcast.TransportBroadcastOperatio  
nAction  
$AsyncBroadcastAction.performOperation(TransportBroadcastOperationAction.  
java:232)  
at  
org.elasticsearch.action.support.broadcast.TransportBroadcastOperatio  
nAction  
$AsyncBroadcastAction.performOperation(TransportBroadcastOperationAction.  
java:210)  
at  
org.elasticsearch.action.support.broadcast.TransportBroadcastOperatio  
nAction$AsyncBroadcastAction  
$1.run(TransportBroadcastOperationAction.java:186)  
at  
java.util.concurrent.ThreadPoolExecutor.runWorker(ThreadPoolExecutor.  
java:1110)  
at java.util.concurrent.ThreadPoolExecutor  
$Worker.run(ThreadPoolExecutor  
.java:603)  
at java.lang.Thread.run(Thread.java:722)  
[2011-12-26 15:03:51,787][DEBUG][action.admin.indices.refresh]  
[Aardwolf] [anoth  
er-index][4], node[72m8MJXiRy-oyetVL2Iz\_w], [P], s[INITIALIZING]:  
Failed to exec  
ute  
[org.elasticsearch.action.admin.indices.refresh.RefreshRequest@1c38ba8f]  
org.elasticsearch.index.IndexShardMissingException: [another-index][4]  
missing  
at  
org.elasticsearch.index.service.InternalIndexService.shardSafe(Intern  
alIndexService.java:177)  
at  
org.elasticsearch.action.admin.indices.refresh.TransportRefreshAction  
.shardOperation(TransportRefreshAction.java:128)  
at  
org.elasticsearch.action.admin.indices.refresh.TransportRefreshAction  
.shardOperation(TransportRefreshAction.java:53)  
at  
org.elasticsearch.action.support.broadcast.TransportBroadcastOperatio  
nAction  
$AsyncBroadcastAction.performOperation(TransportBroadcastOperationAction.  
java:232)  
at  
org.elasticsearch.action.support.broadcast.TransportBroadcastOperatio  
nAction  
$AsyncBroadcastAction.performOperation(TransportBroadcastOperationAction.  
java:210)  
at  
org.elasticsearch.action.support.broadcast.TransportBroadcastOperatio  
nAction$AsyncBroadcastAction  
$1.run(TransportBroadcastOperationAction.java:186)  
at  
java.util.concurrent.ThreadPoolExecutor.runWorker(ThreadPoolExecutor.  
java:1110)  
at java.util.concurrent.ThreadPoolExecutor  
$Worker.run(ThreadPoolExecutor  
.java:603)  
at java.lang.Thread.run(Thread.java:722)

I'm wondering if there is anything wrong with my configuration?

My OS: Windows 7 with jdk1.7.0\_01.  
Thank you!

Kerui Min

---

<div class="post-metadata">

**Author:** ![kimchy](https://sea2.discourse-cdn.com/elastic/user_avatar/discuss.elastic.co/kimchy/32/44952_2.png) [@kimchy](https://discuss.elastic.co/u/kimchy)\
**Post date:** [December 26, 2011, 2:33pm UTC](https://discuss.elastic.co/t/failed-to-pass-the-test-from-pyes/6237/2 "2011-12-26T14:33:10Z")

</div>

Thats a failure that should be ignored in elasticsearch (as it might happen  
as part of refresh), you can ignore it. I pushed a fix to ignore it in  
master.

On Mon, Dec 26, 2011 at 9:08 AM, Kerui Min [minkerui@gmail.com](mailto:minkerui@gmail.com) wrote:

> Hi all,
> 
> I have some problem to start working on the elasticsearch. I  
> downloaded the latest version from the website, and download pyes 0.16  
> as the connector. Everything looks fine, but somehow it failed to pass  
> the test pyes/tests/indexing.py. Here is the output from indexing.py:
> 
> # .............F.
> 
> ## FAIL: testMLT ( **main**.IndexingTestCase)
> 
> Traceback (most recent call last):  
> File "indexing.py", line 141, in testMLT  
> self.assertResultContains(result, {u'\_shards': {u'successful': 5,  
> 0, u'total': 5}})  
> File "C:\Python27\lib\site-packages\pyes-0.16.0-py2.7.egg\pyes\tests  
> py", line 24, in assertResultContains  
> self.assertEquals(value, result[key])  
> AssertionError: {u'successful': 5, u'failed': 0, u'total': 5} != {u'su  
> 1, u'failed': 0, u'total': 1}
> 
> - {u'failed': 0, u'successful': 5, u'total': 5}  
> ? ^ ^
> 
> - {u'failed': 0, u'successful': 1, u'total': 1}  
> ? ^ ^
> 
> * * *
> 
> Ran 15 tests in 9.806s
> 
> FAILED (failures=1)
> 
> On the other hand, here is the error message raised by the  
> elasticsearch server:
> 
> [2011-12-26 15:03:51,756][DEBUG][action.admin.indices.refresh]  
> [Aardwolf] [anoth  
> er-index][3], node[72m8MJXiRy-oyetVL2Iz\_w], [P], s[INITIALIZING]:  
> Failed to exec  
> ute  
> [org.elasticsearch.action.admin.indices.refresh.RefreshRequest@1c38ba8f]  
> org.elasticsearch.index.IndexShardMissingException: [another-index][3]  
> missing  
> at  
> org.elasticsearch.index.service.InternalIndexService.shardSafe(Intern  
> alIndexService.java:177)  
> at  
> org.elasticsearch.action.admin.indices.refresh.TransportRefreshAction  
> .shardOperation(TransportRefreshAction.java:128)  
> at  
> org.elasticsearch.action.admin.indices.refresh.TransportRefreshAction  
> .shardOperation(TransportRefreshAction.java:53)  
> at  
> org.elasticsearch.action.support.broadcast.TransportBroadcastOperatio  
> nAction  
> $AsyncBroadcastAction.performOperation(TransportBroadcastOperationAction.  
> java:232)  
> at  
> org.elasticsearch.action.support.broadcast.TransportBroadcastOperatio  
> nAction  
> $AsyncBroadcastAction.performOperation(TransportBroadcastOperationAction.  
> java:210)  
> at  
> org.elasticsearch.action.support.broadcast.TransportBroadcastOperatio  
> nAction$AsyncBroadcastAction  
> $1.run(TransportBroadcastOperationAction.java:186)  
> at  
> java.util.concurrent.ThreadPoolExecutor.runWorker(ThreadPoolExecutor.  
> java:1110)  
> at java.util.concurrent.ThreadPoolExecutor  
> $Worker.run(ThreadPoolExecutor  
> .java:603)  
> at java.lang.Thread.run(Thread.java:722)  
> [2011-12-26 15:03:51,787][DEBUG][action.admin.indices.refresh]  
> [Aardwolf] [anoth  
> er-index][4], node[72m8MJXiRy-oyetVL2Iz\_w], [P], s[INITIALIZING]:  
> Failed to exec  
> ute  
> [org.elasticsearch.action.admin.indices.refresh.RefreshRequest@1c38ba8f]  
> org.elasticsearch.index.IndexShardMissingException: [another-index][4]  
> missing  
> at  
> org.elasticsearch.index.service.InternalIndexService.shardSafe(Intern  
> alIndexService.java:177)  
> at  
> org.elasticsearch.action.admin.indices.refresh.TransportRefreshAction  
> .shardOperation(TransportRefreshAction.java:128)  
> at  
> org.elasticsearch.action.admin.indices.refresh.TransportRefreshAction  
> .shardOperation(TransportRefreshAction.java:53)  
> at  
> org.elasticsearch.action.support.broadcast.TransportBroadcastOperatio  
> nAction  
> $AsyncBroadcastAction.performOperation(TransportBroadcastOperationAction.  
> java:232)  
> at  
> org.elasticsearch.action.support.broadcast.TransportBroadcastOperatio  
> nAction  
> $AsyncBroadcastAction.performOperation(TransportBroadcastOperationAction.  
> java:210)  
> at  
> org.elasticsearch.action.support.broadcast.TransportBroadcastOperatio  
> nAction$AsyncBroadcastAction  
> $1.run(TransportBroadcastOperationAction.java:186)  
> at  
> java.util.concurrent.ThreadPoolExecutor.runWorker(ThreadPoolExecutor.  
> java:1110)  
> at java.util.concurrent.ThreadPoolExecutor  
> $Worker.run(ThreadPoolExecutor  
> .java:603)  
> at java.lang.Thread.run(Thread.java:722)
> 
> I'm wondering if there is anything wrong with my configuration?
> 
> My OS: Windows 7 with jdk1.7.0\_01.  
> Thank you!
> 
> Kerui Min

---

<div class="post-metadata">

**Author:** ![Kerui\_Min](https://avatars.discourse-cdn.com/v4/letter/k/ee59a6/32.png) [@Kerui\_Min](https://discuss.elastic.co/u/Kerui_Min)\
**Post date:** [December 26, 2011, 11:19pm UTC](https://discuss.elastic.co/t/failed-to-pass-the-test-from-pyes/6237/3 "2011-12-26T23:19:40Z")

</div>

Thank you for the reply. I guess some of the testing failures are due  
to the fact that pyes is slightly out of date.

Kerui Min

On Dec 26, 10:33 pm, Shay Banon [kim...@gmail.com](mailto:kim...@gmail.com) wrote:

> Thats a failure that should be ignored in elasticsearch (as it might happen  
> as part of refresh), you can ignore it. I pushed a fix to ignore it in  
> master.
> 
> On Mon, Dec 26, 2011 at 9:08 AM, Kerui Min [minke...@gmail.com](mailto:minke...@gmail.com) wrote:
> 
> > Hi all,
> 
> > I have some problem to start working on the elasticsearch. I  
> > downloaded the latest version from the website, and download pyes 0.16  
> > as the connector. Everything looks fine, but somehow it failed to pass  
> > the test pyes/tests/indexing.py. Here is the output from indexing.py:
> 
> > # .............F.
> > 
> > ## FAIL: testMLT ( **main**.IndexingTestCase)
> > 
> > Traceback (most recent call last):  
> > File "indexing.py", line 141, in testMLT  
> > self.assertResultContains(result, {u'\_shards': {u'successful': 5,  
> > 0, u'total': 5}})  
> > File "C:\Python27\lib\site-packages\pyes-0.16.0-py2.7.egg\pyes\tests  
> > py", line 24, in assertResultContains  
> > self.assertEquals(value, result[key])  
> > AssertionError: {u'successful': 5, u'failed': 0, u'total': 5} != {u'su  
> > 1, u'failed': 0, u'total': 1}
> > 
> > - {u'failed': 0, u'successful': 5, u'total': 5}  
> > ? ^ ^
> 
> > - {u'failed': 0, u'successful': 1, u'total': 1}  
> > ? ^ ^
> 
> > * * *
> > 
> > Ran 15 tests in 9.806s
> 
> > FAILED (failures=1)
> 
> > On the other hand, here is the error message raised by the  
> > elasticsearch server:
> 
> > [2011-12-26 15:03:51,756][DEBUG][action.admin.indices.refresh]  
> > [Aardwolf] [anoth  
> > er-index][3], node[72m8MJXiRy-oyetVL2Iz\_w], [P], s[INITIALIZING]:  
> > Failed to exec  
> > ute  
> > [org.elasticsearch.action.admin.indices.refresh.RefreshRequest@1c38ba8f]  
> > org.elasticsearch.index.IndexShardMissingException: [another-index][3]  
> > missing  
> > at  
> > org.elasticsearch.index.service.InternalIndexService.shardSafe(Intern  
> > alIndexService.java:177)  
> > at  
> > org.elasticsearch.action.admin.indices.refresh.TransportRefreshAction  
> > .shardOperation(TransportRefreshAction.java:128)  
> > at  
> > org.elasticsearch.action.admin.indices.refresh.TransportRefreshAction  
> > .shardOperation(TransportRefreshAction.java:53)  
> > at  
> > org.elasticsearch.action.support.broadcast.TransportBroadcastOperatio  
> > nAction  
> > $AsyncBroadcastAction.performOperation(TransportBroadcastOperationAction.  
> > java:232)  
> > at  
> > org.elasticsearch.action.support.broadcast.TransportBroadcastOperatio  
> > nAction  
> > $AsyncBroadcastAction.performOperation(TransportBroadcastOperationAction.  
> > java:210)  
> > at  
> > org.elasticsearch.action.support.broadcast.TransportBroadcastOperatio  
> > nAction$AsyncBroadcastAction  
> > $1.run(TransportBroadcastOperationAction.java:186)  
> > at  
> > java.util.concurrent.ThreadPoolExecutor.runWorker(ThreadPoolExecutor.  
> > java:1110)  
> > at java.util.concurrent.ThreadPoolExecutor  
> > $Worker.run(ThreadPoolExecutor  
> > .java:603)  
> > at java.lang.Thread.run(Thread.java:722)  
> > [2011-12-26 15:03:51,787][DEBUG][action.admin.indices.refresh]  
> > [Aardwolf] [anoth  
> > er-index][4], node[72m8MJXiRy-oyetVL2Iz\_w], [P], s[INITIALIZING]:  
> > Failed to exec  
> > ute  
> > [org.elasticsearch.action.admin.indices.refresh.RefreshRequest@1c38ba8f]  
> > org.elasticsearch.index.IndexShardMissingException: [another-index][4]  
> > missing  
> > at  
> > org.elasticsearch.index.service.InternalIndexService.shardSafe(Intern  
> > alIndexService.java:177)  
> > at  
> > org.elasticsearch.action.admin.indices.refresh.TransportRefreshAction  
> > .shardOperation(TransportRefreshAction.java:128)  
> > at  
> > org.elasticsearch.action.admin.indices.refresh.TransportRefreshAction  
> > .shardOperation(TransportRefreshAction.java:53)  
> > at  
> > org.elasticsearch.action.support.broadcast.TransportBroadcastOperatio  
> > nAction  
> > $AsyncBroadcastAction.performOperation(TransportBroadcastOperationAction.  
> > java:232)  
> > at  
> > org.elasticsearch.action.support.broadcast.TransportBroadcastOperatio  
> > nAction  
> > $AsyncBroadcastAction.performOperation(TransportBroadcastOperationAction.  
> > java:210)  
> > at  
> > org.elasticsearch.action.support.broadcast.TransportBroadcastOperatio  
> > nAction$AsyncBroadcastAction  
> > $1.run(TransportBroadcastOperationAction.java:186)  
> > at  
> > java.util.concurrent.ThreadPoolExecutor.runWorker(ThreadPoolExecutor.  
> > java:1110)  
> > at java.util.concurrent.ThreadPoolExecutor  
> > $Worker.run(ThreadPoolExecutor  
> > .java:603)  
> > at java.lang.Thread.run(Thread.java:722)
> 
> > I'm wondering if there is anything wrong with my configuration?
> 
> > My OS: Windows 7 with jdk1.7.0\_01.  
> > Thank you!
> 
> > Kerui Min

---

<div class="post-metadata">

**Author:** ![Alberto\_Paro\_2](https://sea2.discourse-cdn.com/elastic/user_avatar/discuss.elastic.co/alberto_paro_2/32/1137_2.png) [@Alberto\_Paro\_2](https://discuss.elastic.co/u/Alberto_Paro_2)\
**Post date:** [January 27, 2012, 4:35pm UTC](https://discuss.elastic.co/t/failed-to-pass-the-test-from-pyes/6237/4 "2012-01-27T16:35:00Z")

</div>

the test failure is due to the default es configuration is a 5 shards index. in your setup, you are using an 1 shard index.

The main development of pyes is on github. The pypi version is outdated.

hi,  
Alberto

Inviato da iPhone

Il giorno 27/dic/2011, alle ore 00:19, Kerui Min [minkerui@gmail.com](mailto:minkerui@gmail.com) ha scritto:

> Thank you for the reply. I guess some of the testing failures are due  
> to the fact that pyes is slightly out of date.
> 
> Kerui Min
> 
> On Dec 26, 10:33 pm, Shay Banon [kim...@gmail.com](mailto:kim...@gmail.com) wrote:
> 
> > Thats a failure that should be ignored in elasticsearch (as it might happen  
> > as part of refresh), you can ignore it. I pushed a fix to ignore it in  
> > master.
> > 
> > On Mon, Dec 26, 2011 at 9:08 AM, Kerui Min [minke...@gmail.com](mailto:minke...@gmail.com) wrote:
> > 
> > > Hi all,
> > 
> > > I have some problem to start working on the elasticsearch. I  
> > > downloaded the latest version from the website, and download pyes 0.16  
> > > as the connector. Everything looks fine, but somehow it failed to pass  
> > > the test pyes/tests/indexing.py. Here is the output from indexing.py:
> > 
> > > # .............F.
> > > 
> > > ## FAIL: testMLT ( **main**.IndexingTestCase)
> > > 
> > > Traceback (most recent call last):  
> > > File "indexing.py", line 141, in testMLT  
> > > self.assertResultContains(result, {u'\_shards': {u'successful': 5,  
> > > 0, u'total': 5}})  
> > > File "C:\Python27\lib\site-packages\pyes-0.16.0-py2.7.egg\pyes\tests  
> > > py", line 24, in assertResultContains  
> > > self.assertEquals(value, result[key])  
> > > AssertionError: {u'successful': 5, u'failed': 0, u'total': 5} != {u'su  
> > > 1, u'failed': 0, u'total': 1}
> > > 
> > > - {u'failed': 0, u'successful': 5, u'total': 5}  
> > > ? ^ ^
> > 
> > > - {u'failed': 0, u'successful': 1, u'total': 1}  
> > > ? ^ ^
> > 
> > > * * *
> > > 
> > > Ran 15 tests in 9.806s
> > 
> > > FAILED (failures=1)
> > 
> > > On the other hand, here is the error message raised by the  
> > > elasticsearch server:
> > 
> > > [2011-12-26 15:03:51,756][DEBUG][action.admin.indices.refresh]  
> > > [Aardwolf] [anoth  
> > > er-index][3], node[72m8MJXiRy-oyetVL2Iz\_w], [P], s[INITIALIZING]:  
> > > Failed to exec  
> > > ute  
> > > [org.elasticsearch.action.admin.indices.refresh.RefreshRequest@1c38ba8f]  
> > > org.elasticsearch.index.IndexShardMissingException: [another-index][3]  
> > > missing  
> > > at  
> > > org.elasticsearch.index.service.InternalIndexService.shardSafe(Intern  
> > > alIndexService.java:177)  
> > > at  
> > > org.elasticsearch.action.admin.indices.refresh.TransportRefreshAction  
> > > .shardOperation(TransportRefreshAction.java:128)  
> > > at  
> > > org.elasticsearch.action.admin.indices.refresh.TransportRefreshAction  
> > > .shardOperation(TransportRefreshAction.java:53)  
> > > at  
> > > org.elasticsearch.action.support.broadcast.TransportBroadcastOperatio  
> > > nAction  
> > > $AsyncBroadcastAction.performOperation(TransportBroadcastOperationAction.  
> > > java:232)  
> > > at  
> > > org.elasticsearch.action.support.broadcast.TransportBroadcastOperatio  
> > > nAction  
> > > $AsyncBroadcastAction.performOperation(TransportBroadcastOperationAction.  
> > > java:210)  
> > > at  
> > > org.elasticsearch.action.support.broadcast.TransportBroadcastOperatio  
> > > nAction$AsyncBroadcastAction  
> > > $1.run(TransportBroadcastOperationAction.java:186)  
> > > at  
> > > java.util.concurrent.ThreadPoolExecutor.runWorker(ThreadPoolExecutor.  
> > > java:1110)  
> > > at java.util.concurrent.ThreadPoolExecutor  
> > > $Worker.run(ThreadPoolExecutor  
> > > .java:603)  
> > > at java.lang.Thread.run(Thread.java:722)  
> > > [2011-12-26 15:03:51,787][DEBUG][action.admin.indices.refresh]  
> > > [Aardwolf] [anoth  
> > > er-index][4], node[72m8MJXiRy-oyetVL2Iz\_w], [P], s[INITIALIZING]:  
> > > Failed to exec  
> > > ute  
> > > [org.elasticsearch.action.admin.indices.refresh.RefreshRequest@1c38ba8f]  
> > > org.elasticsearch.index.IndexShardMissingException: [another-index][4]  
> > > missing  
> > > at  
> > > org.elasticsearch.index.service.InternalIndexService.shardSafe(Intern  
> > > alIndexService.java:177)  
> > > at  
> > > org.elasticsearch.action.admin.indices.refresh.TransportRefreshAction  
> > > .shardOperation(TransportRefreshAction.java:128)  
> > > at  
> > > org.elasticsearch.action.admin.indices.refresh.TransportRefreshAction  
> > > .shardOperation(TransportRefreshAction.java:53)  
> > > at  
> > > org.elasticsearch.action.support.broadcast.TransportBroadcastOperatio  
> > > nAction  
> > > $AsyncBroadcastAction.performOperation(TransportBroadcastOperationAction.  
> > > java:232)  
> > > at  
> > > org.elasticsearch.action.support.broadcast.TransportBroadcastOperatio  
> > > nAction  
> > > $AsyncBroadcastAction.performOperation(TransportBroadcastOperationAction.  
> > > java:210)  
> > > at  
> > > org.elasticsearch.action.support.broadcast.TransportBroadcastOperatio  
> > > nAction$AsyncBroadcastAction  
> > > $1.run(TransportBroadcastOperationAction.java:186)  
> > > at  
> > > java.util.concurrent.ThreadPoolExecutor.runWorker(ThreadPoolExecutor.  
> > > java:1110)  
> > > at java.util.concurrent.ThreadPoolExecutor  
> > > $Worker.run(ThreadPoolExecutor  
> > > .java:603)  
> > > at java.lang.Thread.run(Thread.java:722)
> > 
> > > I'm wondering if there is anything wrong with my configuration?
> > 
> > > My OS: Windows 7 with jdk1.7.0\_01.  
> > > Thank you!
> > 
> > > Kerui Min

---

<div class="post-metadata">

**Author:** ![system](https://us1.discourse-cdn.com/elastic/original/3X/1/a/1ac57faf039f6b580b3f104ef42a2a89e41014de.png) [@system](https://discuss.elastic.co/u/system)\
**Post date:** [July 6, 2017, 3:41am UTC](https://discuss.elastic.co/t/failed-to-pass-the-test-from-pyes/6237/5 "2017-07-06T03:41:16Z")

</div>


