# Java agent build test fail

**URL:** <https://discuss.elastic.co/t/java-agent-build-test-fail/155962>\
**Category:** APM\
**Created:** [November 8, 2018, 10:45pm UTC](https://discuss.elastic.co/t/java-agent-build-test-fail/155962 "2018-11-08T22:45:04Z")\
**Posts on this page:** 4\
**Page:** 1

<div class="post-metadata">

**Author:** ![paulkeogh](https://avatars.discourse-cdn.com/v4/letter/p/8dc957/32.png) [@paulkeogh](https://discuss.elastic.co/u/paulkeogh)\
**Post date:** [November 8, 2018, 10:45pm UTC](https://discuss.elastic.co/t/java-agent-build-test-fail/155962/1 "2018-11-08T22:45:04Z")

</div>

I am trying to build the master branch of the Java agent but one of unit tests is failing;

```
Tests run: 22, Failures: 1, Errors: 0, Skipped: 0, Time elapsed: 3.847 sec <<< FAILURE! - in co.elastic.apm.opentracing.OpenTracingBridgeTest
sanityCheckRealTimestamps Time elapsed: 0.016 sec <<< FAILURE!
java.lang.AssertionError: 

Expecting:
 <1541716866705483L>
to be between:
 [1541716806705482L, 1541716866705482L]
	at co.elastic.apm.opentracing.OpenTracingBridgeTest.sanityCheckRealTimestamps(OpenTracingBridgeTest.java:78)

```

mvn command is mvn clean test.

Any ideas ?

---

<div class="post-metadata">

**Author:** ![felixbarny](https://sea2.discourse-cdn.com/elastic/user_avatar/discuss.elastic.co/felixbarny/32/27341_2.png) [@felixbarny](https://discuss.elastic.co/u/felixbarny)\
**Post date:** [November 9, 2018, 3:48pm UTC](https://discuss.elastic.co/t/java-agent-build-test-fail/155962/2 "2018-11-09T15:48:33Z")

</div>

Thanks for the report! That is a strange one, I have just pushed a fix to make the test more resilient.

---

<div class="post-metadata">

**Author:** ![paulkeogh](https://avatars.discourse-cdn.com/v4/letter/p/8dc957/32.png) [@paulkeogh](https://discuss.elastic.co/u/paulkeogh)\
**Post date:** [November 12, 2018, 9:26am UTC](https://discuss.elastic.co/t/java-agent-build-test-fail/155962/3 "2018-11-12T09:26:52Z")

</div>

Looks good thanks !

---

<div class="post-metadata">

**Author:** ![system](https://us1.discourse-cdn.com/elastic/original/3X/1/a/1ac57faf039f6b580b3f104ef42a2a89e41014de.png) [@system](https://discuss.elastic.co/u/system)\
**Post date:** [December 3, 2018, 5:36am UTC](https://discuss.elastic.co/t/java-agent-build-test-fail/155962/4 "2018-12-03T05:36:20Z")

</div>

This topic was automatically closed 20 days after the last reply. New replies are no longer allowed.
