# Logstash 8.12.2 rubyTests are failing

**URL:** <https://discuss.elastic.co/t/logstash-8-12-2-rubytests-are-failing/356059>\
**Category:** Logstash\
**Tags:** elastic-stack-monitoring, elastic-stack-alerting\
**Created:** [March 24, 2024, 4:04pm UTC](https://discuss.elastic.co/t/logstash-8-12-2-rubytests-are-failing/356059 "2024-03-24T16:04:35Z")\
**Posts on this page:** 3\
**Page:** 1

<div class="post-metadata">

**Author:** ![Nikhitha\_Karennagari](https://sea2.discourse-cdn.com/elastic/user_avatar/discuss.elastic.co/nikhitha_karennagari/32/111864_2.png) [@Nikhitha\_Karennagari](https://discuss.elastic.co/u/Nikhitha_Karennagari)\
**Post date:** [March 24, 2024, 4:04pm UTC](https://discuss.elastic.co/t/logstash-8-12-2-rubytests-are-failing/356059/1 "2024-03-24T16:04:35Z")

</div>

Hi all,

LOgstash 8.12.2 rubyTests are failing with the following error:

```auto
org.logstash.RSpecTests > rspecTests[core tests] FAILED
    java.lang.AssertionError: RSpec test suite `core tests` saw at least one failure.

```

```auto
----------------------------------------------------------------------
| Results: FAILURE (25 tests, 23 successes, 1 failures, 1 skipped) |
----------------------------------------------------------------------

25 tests completed, 1 failed, 1 skipped

> Task :logstash-core:rubyTests FAILED

FAILURE: Build failed with an exception.

* What went wrong:
Execution failed for task ':logstash-core:rubyTests'.
> Process 'Gradle Test Executor 1' finished with non-zero exit value 1
  This problem might be caused by incorrect test process configuration.
  Please refer to the test execution section in the User Manual at https://docs.gradle.org/7.5/userguide/java_testing.html#sec:test_execution

* Try:
> Run with --info or --debug option to get more log output.
> Run with --scan to get full insights.

* Exception is:
org.gradle.api.tasks.TaskExecutionException: Execution failed for task ':logstash-core:rubyTests'.
        at org.gradle.api.internal.tasks.execution.ExecuteActionsTaskExecuter.lambda$executeIfValid$1(ExecuteActionsTaskExecuter.java:142)
        at org.gradle.internal.Try$Failure.ifSuccessfulOrElse(Try.java:282)
        at org.gradle.api.internal.tasks.execution.ExecuteActionsTaskExecuter.executeIfValid(ExecuteActionsTaskExecuter.java:140)
        at org.gradle.api.internal.tasks.execution.ExecuteActionsTaskExecuter.execute(ExecuteActionsTaskExecuter.java:128)
        at org.gradle.api.internal.tasks.execution.CleanupStaleOutputsExecuter.execute(CleanupStaleOutputsExecuter.java:77)
        at org.gradle.api.internal.tasks.execution.FinalizePropertiesTaskExecuter.execute(FinalizePropertiesTaskExecuter.java:46)
        at org.gradle.api.internal.tasks.execution.ResolveTaskExecutionModeExecuter.execute(ResolveTaskExecutionModeExecuter.java:51)
        at org.gradle.api.internal.tasks.execution.SkipTaskWithNoActionsExecuter.execute(SkipTaskWithNoActionsExecuter.java:57)
        at org.gradle.api.internal.tasks.execution.SkipOnlyIfTaskExecuter.execute(SkipOnlyIfTaskExecuter.java:56)
        at org.gradle.api.internal.tasks.execution.CatchExceptionTaskExecuter.execute(CatchExceptionTaskExecuter.java:36)
        at org.gradle.api.internal.tasks.execution.EventFiringTaskExecuter$1.executeTask(EventFiringTaskExecuter.java:77)
        at org.gradle.api.internal.tasks.execution.EventFiringTaskExecuter$1.call(EventFiringTaskExecuter.java:55)
        at org.gradle.api.internal.tasks.execution.EventFiringTaskExecuter$1.call(EventFiringTaskExecuter.java:52)
        at org.gradle.internal.operations.DefaultBuildOperationRunner$CallableBuildOperationWorker.execute(DefaultBuildOperationRunner.java:204)
        at org.gradle.internal.operations.DefaultBuildOperationRunner$CallableBuildOperationWorker.execute(DefaultBuildOperationRunner.java:199)
        at org.gradle.internal.operations.DefaultBuildOperationRunner$2.execute(DefaultBuildOperationRunner.java:66)
        at org.gradle.internal.operations.DefaultBuildOperationRunner$2.execute(DefaultBuildOperationRunner.java:59)
        at org.gradle.internal.operations.DefaultBuildOperationRunner.execute(DefaultBuildOperationRunner.java:157)
        at org.gradle.internal.operations.DefaultBuildOperationRunner.execute(DefaultBuildOperationRunner.java:59)
        at org.gradle.internal.operations.DefaultBuildOperationRunner.call(DefaultBuildOperationRunner.java:53)
        at org.gradle.internal.operations.DefaultBuildOperationExecutor.call(DefaultBuildOperationExecutor.java:73)
        at org.gradle.api.internal.tasks.execution.EventFiringTaskExecuter.execute(EventFiringTaskExecuter.java:52)
        at org.gradle.execution.plan.LocalTaskNodeExecutor.execute(LocalTaskNodeExecutor.java:69)
        at org.gradle.execution.taskgraph.DefaultTaskExecutionGraph$InvokeNodeExecutorsAction.execute(DefaultTaskExecutionGraph.java:327)
        at org.gradle.execution.taskgraph.DefaultTaskExecutionGraph$InvokeNodeExecutorsAction.execute(DefaultTaskExecutionGraph.java:314)
        at org.gradle.execution.taskgraph.DefaultTaskExecutionGraph$BuildOperationAwareExecutionAction.execute(DefaultTaskExecutionGraph.java:307)
        at org.gradle.execution.taskgraph.DefaultTaskExecutionGraph$BuildOperationAwareExecutionAction.execute(DefaultTaskExecutionGraph.java:293)
        at org.gradle.execution.plan.DefaultPlanExecutor$ExecutorWorker.execute(DefaultPlanExecutor.java:417)
        at org.gradle.execution.plan.DefaultPlanExecutor$ExecutorWorker.run(DefaultPlanExecutor.java:339)
        at org.gradle.internal.concurrent.ExecutorPolicy$CatchAndRecordFailures.onExecute(ExecutorPolicy.java:64)
        at org.gradle.internal.concurrent.ManagedExecutorImpl$1.run(ManagedExecutorImpl.java:48)
Caused by: org.gradle.process.internal.ExecException: Process 'Gradle Test Executor 1' finished with non-zero exit value 1
This problem might be caused by incorrect test process configuration.
Please refer to the test execution section in the User Manual at https://docs.gradle.org/7.5/userguide/java_testing.html#sec:test_execution

```

Moreover there are multiple exceptions seen on Out of Memory Error

```auto
Exception: java.lang.OutOfMemoryError thrown from the UncaughtExceptionHandler

```

**Steps to reproduce the error:**  
Use the latest logstash 8.12.2 from github  
Run "./gradlew rubyTests --stacktrace"

---

<div class="post-metadata">

**Author:** ![Nikhitha\_Karennagari](https://sea2.discourse-cdn.com/elastic/user_avatar/discuss.elastic.co/nikhitha_karennagari/32/111864_2.png) [@Nikhitha\_Karennagari](https://discuss.elastic.co/u/Nikhitha_Karennagari)\
**Post date:** [March 25, 2024, 4:55am UTC](https://discuss.elastic.co/t/logstash-8-12-2-rubytests-are-failing/356059/2 "2024-03-25T04:55:52Z")

</div>

@Badger , Could you please help on this issue.

Thanks in Advance!

---

<div class="post-metadata">

**Author:** ![system](https://us1.discourse-cdn.com/elastic/original/3X/1/a/1ac57faf039f6b580b3f104ef42a2a89e41014de.png) [@system](https://discuss.elastic.co/u/system)\
**Post date:** [April 22, 2024, 4:56am UTC](https://discuss.elastic.co/t/logstash-8-12-2-rubytests-are-failing/356059/3 "2024-04-22T04:56:30Z")

</div>

This topic was automatically closed 28 days after the last reply. New replies are no longer allowed.
