# Task integTestCluster did not run automatically when run task integTest on version 7.5

**URL:** https://discuss.elastic.co/t/task-integtestcluster-did-not-run-automatically-when-run-task-integtest-on-version-7-5/212637
**Category:** Elasticsearch
**Created:** [December 20, 2019, 9:54am UTC](https://discuss.elastic.co/t/task-integtestcluster-did-not-run-automatically-when-run-task-integtest-on-version-7-5/212637 "2019-12-20T09:54:05Z")
**Posts on this page:** 2
**Page:** 1

<div class="post-metadata">

### Author: ![Ethan-Zhang](https://sea2.discourse-cdn.com/elastic/user_avatar/discuss.elastic.co/ethan-zhang/32/54812_2.png) [@Ethan-Zhang](https://discuss.elastic.co/u/Ethan-Zhang)
#### Post date: [December 20, 2019, 9:54am UTC](https://discuss.elastic.co/t/task-integtestcluster-did-not-run-automatically-when-run-task-integtest-on-version-7-5/212637/1 "2019-12-20T09:54:06Z")

</div>

When I upgrade the ES version from 7.4.0 to 7.5.1 in the plugin build, the integTestCluster task did not run automatically before task integTestRunner. Giving the error of `Caused by: java.lang.NullPointerException: Can't wait for `node{::integTest-0}` as it's not started. Does the task have `useCluster` ?`

```auto
17:47:37: Executing task 'build --stacktrace'...

> Task :generateGlobalBuildInfo UP-TO-DATE

> Task :printGlobalBuildInfo UP-TO-DATE
=======================================
Elasticsearch Build Hamster says Hello!
  Gradle Version : 5.6.2
  OS Info : Mac OS X 10.14.6 (x86_64)
  JDK Version : 12 (Oracle Corporation 12.0.1 [Java HotSpot(TM) 64-Bit Server VM 12.0.1+12])
  JAVA_HOME : /Library/Java/JavaVirtualMachines/jdk-12.0.1.jdk/Contents/Home
  Random Testing Seed : 50A17BE7A343C798
=======================================

> Task :generateNotice UP-TO-DATE
> Task :compileJava UP-TO-DATE
> Task :processResources NO-SOURCE
> Task :classes UP-TO-DATE
> Task :jar UP-TO-DATE
> Task :copyPluginPropertiesTemplate UP-TO-DATE
> Task :pluginProperties UP-TO-DATE
> Task :bundlePlugin UP-TO-DATE
> Task :extractElasticsearch7.5.1 UP-TO-DATE
> Task :javadoc UP-TO-DATE
> Task :javadocJar UP-TO-DATE
> Task :sourcesJar UP-TO-DATE
> Task :assemble UP-TO-DATE
> Task :copyCheckstyleConf UP-TO-DATE
> Task :checkstyleMain SKIPPED
> Task :copyRestSpec UP-TO-DATE
> Task :compileTestJava UP-TO-DATE
> Task :processTestResources UP-TO-DATE
> Task :testClasses UP-TO-DATE
> Task :checkstyleTest SKIPPED
> Task :buildResources UP-TO-DATE
> Task :forbiddenApisMain SKIPPED
> Task :forbiddenApisTest SKIPPED
> Task :forbiddenApis UP-TO-DATE
> Task :checkstyle UP-TO-DATE
> Task :dependencyLicenses SKIPPED
> Task :filepermissions UP-TO-DATE
> Task :forbiddenPatterns UP-TO-DATE
> Task :jarHell UP-TO-DATE
> Task :licenseHeaders SKIPPED
> Task :loggerUsageCheck UP-TO-DATE
> Task :testingConventions UP-TO-DATE
> Task :thirdPartyAudit SKIPPED
> Task :precommit UP-TO-DATE
> Task :test
> Task :integTestRunner FAILED

FAILURE: Build failed with an exception.

* What went wrong:
Execution failed for task ':integTestRunner'.
> Can't wait for `node{::integTest-0}` as it's not started. Does the task have `useCluster` ?

* Try:
Run with --info or --debug option to get more log output. Run with --scan to get full insights.

* Exception is:
org.gradle.api.tasks.TaskExecutionException: Execution failed for task ':integTestRunner'.
	at org.gradle.api.internal.tasks.execution.ExecuteActionsTaskExecuter$3.accept(ExecuteActionsTaskExecuter.java:166)
	at org.gradle.api.internal.tasks.execution.ExecuteActionsTaskExecuter$3.accept(ExecuteActionsTaskExecuter.java:163)
	at org.gradle.internal.Try$Failure.ifSuccessfulOrElse(Try.java:191)
	at org.gradle.api.internal.tasks.execution.ExecuteActionsTaskExecuter.execute(ExecuteActionsTaskExecuter.java:156)
	at org.gradle.api.internal.tasks.execution.ValidatingTaskExecuter.execute(ValidatingTaskExecuter.java:62)
	at org.gradle.api.internal.tasks.execution.SkipEmptySourceFilesTaskExecuter.execute(SkipEmptySourceFilesTaskExecuter.java:108)
	at org.gradle.api.internal.tasks.execution.ResolveBeforeExecutionOutputsTaskExecuter.execute(ResolveBeforeExecutionOutputsTaskExecuter.java:67)
	at org.gradle.api.internal.tasks.execution.ResolveAfterPreviousExecutionStateTaskExecuter.execute(ResolveAfterPreviousExecutionStateTaskExecuter.java:46)
	at org.gradle.api.internal.tasks.execution.CleanupStaleOutputsExecuter.execute(CleanupStaleOutputsExecuter.java:94)
	at org.gradle.api.internal.tasks.execution.FinalizePropertiesTaskExecuter.execute(FinalizePropertiesTaskExecuter.java:46)
	at org.gradle.api.internal.tasks.execution.ResolveTaskExecutionModeExecuter.execute(ResolveTaskExecutionModeExecuter.java:95)
	at org.gradle.api.internal.tasks.execution.SkipTaskWithNoActionsExecuter.execute(SkipTaskWithNoActionsExecuter.java:57)
	at org.gradle.api.internal.tasks.execution.SkipOnlyIfTaskExecuter.execute(SkipOnlyIfTaskExecuter.java:56)
	at org.gradle.api.internal.tasks.execution.CatchExceptionTaskExecuter.execute(CatchExceptionTaskExecuter.java:36)
	at org.gradle.api.internal.tasks.execution.EventFiringTaskExecuter$1.executeTask(EventFiringTaskExecuter.java:77)
	at org.gradle.api.internal.tasks.execution.EventFiringTaskExecuter$1.call(EventFiringTaskExecuter.java:55)
	at org.gradle.api.internal.tasks.execution.EventFiringTaskExecuter$1.call(EventFiringTaskExecuter.java:52)
	at org.gradle.internal.operations.DefaultBuildOperationExecutor$CallableBuildOperationWorker.execute(DefaultBuildOperationExecutor.java:416)
	at org.gradle.internal.operations.DefaultBuildOperationExecutor$CallableBuildOperationWorker.execute(DefaultBuildOperationExecutor.java:406)
	at org.gradle.internal.operations.DefaultBuildOperationExecutor$1.execute(DefaultBuildOperationExecutor.java:165)
	at org.gradle.internal.operations.DefaultBuildOperationExecutor.execute(DefaultBuildOperationExecutor.java:250)
	at org.gradle.internal.operations.DefaultBuildOperationExecutor.execute(DefaultBuildOperationExecutor.java:158)
	at org.gradle.internal.operations.DefaultBuildOperationExecutor.call(DefaultBuildOperationExecutor.java:102)
	at org.gradle.internal.operations.DelegatingBuildOperationExecutor.call(DelegatingBuildOperationExecutor.java:36)
	at org.gradle.api.internal.tasks.execution.EventFiringTaskExecuter.execute(EventFiringTaskExecuter.java:52)
	at org.gradle.execution.plan.LocalTaskNodeExecutor.execute(LocalTaskNodeExecutor.java:43)
	at org.gradle.execution.taskgraph.DefaultTaskExecutionGraph$InvokeNodeExecutorsAction.execute(DefaultTaskExecutionGraph.java:355)
	at org.gradle.execution.taskgraph.DefaultTaskExecutionGraph$InvokeNodeExecutorsAction.execute(DefaultTaskExecutionGraph.java:343)
	at org.gradle.execution.taskgraph.DefaultTaskExecutionGraph$BuildOperationAwareExecutionAction.execute(DefaultTaskExecutionGraph.java:336)
	at org.gradle.execution.taskgraph.DefaultTaskExecutionGraph$BuildOperationAwareExecutionAction.execute(DefaultTaskExecutionGraph.java:322)
	at org.gradle.execution.plan.DefaultPlanExecutor$ExecutorWorker$1.execute(DefaultPlanExecutor.java:134)
	at org.gradle.execution.plan.DefaultPlanExecutor$ExecutorWorker$1.execute(DefaultPlanExecutor.java:129)
	at org.gradle.execution.plan.DefaultPlanExecutor$ExecutorWorker.execute(DefaultPlanExecutor.java:202)
	at org.gradle.execution.plan.DefaultPlanExecutor$ExecutorWorker.executeNextNode(DefaultPlanExecutor.java:193)
	at org.gradle.execution.plan.DefaultPlanExecutor$ExecutorWorker.run(DefaultPlanExecutor.java:129)
	at org.gradle.internal.concurrent.ExecutorPolicy$CatchAndRecordFailures.onExecute(ExecutorPolicy.java:64)
	at org.gradle.internal.concurrent.ManagedExecutorImpl$1.run(ManagedExecutorImpl.java:48)
	at org.gradle.internal.concurrent.ThreadFactoryImpl$ManagedThreadRunnable.run(ThreadFactoryImpl.java:56)
Caused by: java.lang.NullPointerException: Can't wait for `node{::integTest-0}` as it's not started. Does the task have `useCluster` ?
	at org.elasticsearch.gradle.testclusters.ElasticsearchNode.isProcessAlive(ElasticsearchNode.java:1200)
	at org.elasticsearch.gradle.testclusters.TestClusterConfiguration.lambda$waitForConditions$0(TestClusterConfiguration.java:123)
	at org.elasticsearch.gradle.testclusters.TestClusterConfiguration.waitForConditions(TestClusterConfiguration.java:116)
	at org.elasticsearch.gradle.testclusters.ElasticsearchNode.waitForAllConditions(ElasticsearchNode.java:1208)
	at org.elasticsearch.gradle.testclusters.ElasticsearchNode.getAllTransportPortURI(ElasticsearchNode.java:739)
	at org.elasticsearch.gradle.testclusters.ElasticsearchCluster.lambda$writeUnicastHostsFiles$30(ElasticsearchCluster.java:382)
	at org.elasticsearch.gradle.testclusters.ElasticsearchCluster.writeUnicastHostsFiles(ElasticsearchCluster.java:382)
	at org.elasticsearch.gradle.testclusters.ElasticsearchCluster.waitForAllConditions(ElasticsearchCluster.java:421)
	at org.elasticsearch.gradle.testclusters.ElasticsearchCluster.getAllHttpSocketURI(ElasticsearchCluster.java:409)
	at java.base/jdk.internal.reflect.NativeMethodAccessorImpl.invoke0(Native Method)
	at java.base/jdk.internal.reflect.NativeMethodAccessorImpl.invoke(NativeMethodAccessorImpl.java:62)
	at java.base/jdk.internal.reflect.DelegatingMethodAccessorImpl.invoke(DelegatingMethodAccessorImpl.java:43)
	at org.elasticsearch.gradle.test.RestIntegTestTask$_closure2.doCall(RestIntegTestTask.groovy:63)
	at java.base/jdk.internal.reflect.NativeMethodAccessorImpl.invoke0(Native Method)
	at java.base/jdk.internal.reflect.NativeMethodAccessorImpl.invoke(NativeMethodAccessorImpl.java:62)
	at java.base/jdk.internal.reflect.DelegatingMethodAccessorImpl.invoke(DelegatingMethodAccessorImpl.java:43)
	at org.elasticsearch.gradle.SystemPropertyCommandLineArgumentProvider.lambda$asArguments$0(SystemPropertyCommandLineArgumentProvider.java:21)
	at org.elasticsearch.gradle.SystemPropertyCommandLineArgumentProvider.asArguments(SystemPropertyCommandLineArgumentProvider.java:22)
	at org.gradle.process.internal.DefaultJavaForkOptions.copyTo(DefaultJavaForkOptions.java:220)
	at org.gradle.api.tasks.testing.Test.copyTo(Test.java:566)
	at org.gradle.api.tasks.testing.Test.createTestExecutionSpec(Test.java:578)
	at org.gradle.api.tasks.testing.Test.createTestExecutionSpec(Test.java:138)
	at org.gradle.api.tasks.testing.AbstractTestTask.executeTests(AbstractTestTask.java:451)
	at org.gradle.api.tasks.testing.Test.executeTests(Test.java:613)
	at java.base/jdk.internal.reflect.NativeMethodAccessorImpl.invoke0(Native Method)
	at java.base/jdk.internal.reflect.NativeMethodAccessorImpl.invoke(NativeMethodAccessorImpl.java:62)
	at java.base/jdk.internal.reflect.DelegatingMethodAccessorImpl.invoke(DelegatingMethodAccessorImpl.java:43)
	at org.gradle.internal.reflect.JavaMethod.invoke(JavaMethod.java:103)
	at org.gradle.api.internal.project.taskfactory.StandardTaskAction.doExecute(StandardTaskAction.java:49)
	at org.gradle.api.internal.project.taskfactory.StandardTaskAction.execute(StandardTaskAction.java:42)
	at org.gradle.api.internal.project.taskfactory.StandardTaskAction.execute(StandardTaskAction.java:28)
	at org.gradle.api.internal.AbstractTask$TaskActionWrapper.execute(AbstractTask.java:717)
	at org.gradle.api.internal.AbstractTask$TaskActionWrapper.execute(AbstractTask.java:684)
	at org.gradle.api.internal.tasks.execution.ExecuteActionsTaskExecuter$5.run(ExecuteActionsTaskExecuter.java:476)
	at org.gradle.internal.operations.DefaultBuildOperationExecutor$RunnableBuildOperationWorker.execute(DefaultBuildOperationExecutor.java:402)
	at org.gradle.internal.operations.DefaultBuildOperationExecutor$RunnableBuildOperationWorker.execute(DefaultBuildOperationExecutor.java:394)
	at org.gradle.internal.operations.DefaultBuildOperationExecutor$1.execute(DefaultBuildOperationExecutor.java:165)
	at org.gradle.internal.operations.DefaultBuildOperationExecutor.execute(DefaultBuildOperationExecutor.java:250)
	at org.gradle.internal.operations.DefaultBuildOperationExecutor.execute(DefaultBuildOperationExecutor.java:158)
	at org.gradle.internal.operations.DefaultBuildOperationExecutor.run(DefaultBuildOperationExecutor.java:92)
	at org.gradle.internal.operations.DelegatingBuildOperationExecutor.run(DelegatingBuildOperationExecutor.java:31)
	at org.gradle.api.internal.tasks.execution.ExecuteActionsTaskExecuter.executeAction(ExecuteActionsTaskExecuter.java:461)
	at org.gradle.api.internal.tasks.execution.ExecuteActionsTaskExecuter.executeActions(ExecuteActionsTaskExecuter.java:444)
	at org.gradle.api.internal.tasks.execution.ExecuteActionsTaskExecuter.access$200(ExecuteActionsTaskExecuter.java:93)
	at org.gradle.api.internal.tasks.execution.ExecuteActionsTaskExecuter$TaskExecution.execute(ExecuteActionsTaskExecuter.java:237)
	at org.gradle.internal.execution.steps.ExecuteStep.lambda$execute$1(ExecuteStep.java:33)
	at org.gradle.internal.execution.steps.ExecuteStep.execute(ExecuteStep.java:33)
	at org.gradle.internal.execution.steps.ExecuteStep.execute(ExecuteStep.java:26)
	at org.gradle.internal.execution.steps.CleanupOutputsStep.execute(CleanupOutputsStep.java:58)
	at org.gradle.internal.execution.steps.CleanupOutputsStep.execute(CleanupOutputsStep.java:35)
	at org.gradle.internal.execution.steps.ResolveInputChangesStep.execute(ResolveInputChangesStep.java:48)
* Get more help at https://help.gradle.org

BUILD FAILED in 2s
24 actionable tasks: 2 executed, 22 up-to-date
Cause: invalid type code: B0
17:47:40: Task execution finished 'build --stacktrace'.

```

---

<div class="post-metadata">

### Author: ![system](https://us1.discourse-cdn.com/elastic/original/3X/1/a/1ac57faf039f6b580b3f104ef42a2a89e41014de.png) [@system](https://discuss.elastic.co/u/system)
#### Post date: [January 17, 2020, 9:57am UTC](https://discuss.elastic.co/t/task-integtestcluster-did-not-run-automatically-when-run-task-integtest-on-version-7-5/212637/2 "2020-01-17T09:57:53Z")

</div>

This topic was automatically closed 28 days after the last reply. New replies are no longer allowed.
