# Test Failures for Beats v6.1.1 in Metricbeat and Auditbeat

**URL:** <https://discuss.elastic.co/t/test-failures-for-beats-v6-1-1-in-metricbeat-and-auditbeat/114202>\
**Category:** Beats\
**Created:** [January 5, 2018, 5:33am UTC](https://discuss.elastic.co/t/test-failures-for-beats-v6-1-1-in-metricbeat-and-auditbeat/114202 "2018-01-05T05:33:49Z")\
**Posts on this page:** 2\
**Page:** 1

<div class="post-metadata">

**Author:** ![adityap101](https://avatars.discourse-cdn.com/v4/letter/a/7cd45c/32.png) [@adityap101](https://discuss.elastic.co/u/adityap101)\
**Post date:** [January 5, 2018, 5:33am UTC](https://discuss.elastic.co/t/test-failures-for-beats-v6-1-1-in-metricbeat-and-auditbeat/114202/1 "2018-01-05T05:33:49Z")

</div>

I am facing below mentioned test failures for Beats v6.1.1 on Intel x86 - Ubuntu 16.04.  
I have built beats from source using steps:  
make  
make update

Executed tests using command:  
make unit  
make system-tests

These two system-test failures are observed for metricbeat and auditbeat, respectively:

1. test\_process
2. test\_start\_stop

**Log for test\_process (Metricbeat) failure:**

## ====================================================================== FAIL: Test system/process output.

Traceback (most recent call last):  
File "/home/test/src/github.com/elastic/beats/metricbeat/tests/system/test\_system.py", line 408, in test\_process  
self.assertItemsEqual(SYSTEM\_PROCESS\_FIELDS, process.keys())  
AssertionError: Element counts were not equal:  
First has 1, Second has 0: 'cwd'

**Log for test\_start\_stop (Auditbeat) failure:**

## ====================================================================== ERROR: Auditbeat starts and stops without error.

Traceback (most recent call last):  
File "/home/test/src/github.com/elastic/beats/auditbeat/tests/system/test\_base.py", line 18, in test\_start\_stop  
self.wait\_until(lambda: self.log\_contains("start running"))  
File "../../../libbeat/tests/system/beat/beat.py", line 316, in wait\_until  
"Waited {} seconds.".format(max\_timeout))  
TimeoutError: Timeout waiting for 'cond' to be true. Waited 10 seconds.

_**Please note I am using go v1.9.2 and installing by apt-get install golang-1.9 (/usr/lib/go-1.9/bin)**_  
_ **Any workaround/solution to resolve the issue?** _

---

<div class="post-metadata">

**Author:** ![system](https://us1.discourse-cdn.com/elastic/original/3X/1/a/1ac57faf039f6b580b3f104ef42a2a89e41014de.png) [@system](https://discuss.elastic.co/u/system)\
**Post date:** [January 26, 2018, 5:34am UTC](https://discuss.elastic.co/t/test-failures-for-beats-v6-1-1-in-metricbeat-and-auditbeat/114202/2 "2018-01-26T05:34:24Z")

</div>

This topic was automatically closed after 21 days. New replies are no longer allowed.
