# thirdPartyAudit FAILED when gradle check

**URL:** <https://discuss.elastic.co/t/thirdpartyaudit-failed-when-gradle-check/78488>\
**Category:** Elasticsearch\
**Created:** [March 14, 2017, 9:59am UTC](https://discuss.elastic.co/t/thirdpartyaudit-failed-when-gradle-check/78488 "2017-03-14T09:59:49Z")\
**Posts on this page:** 7\
**Page:** 1

<div class="post-metadata">

**Author:** ![JimmyQ](https://avatars.discourse-cdn.com/v4/letter/j/35a633/32.png) [@JimmyQ](https://discuss.elastic.co/u/JimmyQ)\
**Post date:** [March 14, 2017, 9:59am UTC](https://discuss.elastic.co/t/thirdpartyaudit-failed-when-gradle-check/78488/1 "2017-03-14T09:59:49Z")

</div>

Had anyone experienced this error before?

> :benchmarks:thirdPartyAudit FAILED  
> FAILURE: Build failed with an exception.  
> \* What went wrong:  
> Execution failed for task ':benchmarks:thirdPartyAudit'.  
> URI is not hierarchical

I just did "gradle assemble" and then "gradle check" (before these I cloned from git)  
I even did not modify any code  
Thank you in advance  
J

---

<div class="post-metadata">

**Author:** ![dadoonet](https://sea2.discourse-cdn.com/elastic/user_avatar/discuss.elastic.co/dadoonet/32/137187_2.png) [@dadoonet](https://discuss.elastic.co/u/dadoonet)\
**Post date:** [March 14, 2017, 11:49am UTC](https://discuss.elastic.co/t/thirdpartyaudit-failed-when-gradle-check/78488/2 "2017-03-14T11:49:00Z")

</div>

Try a gradle clean again.

Any chance you are running gradle from a subdir ?

---

<div class="post-metadata">

**Author:** ![JimmyQ](https://avatars.discourse-cdn.com/v4/letter/j/35a633/32.png) [@JimmyQ](https://discuss.elastic.co/u/JimmyQ)\
**Post date:** [March 15, 2017, 5:26am UTC](https://discuss.elastic.co/t/thirdpartyaudit-failed-when-gradle-check/78488/3 "2017-03-15T05:26:09Z")

</div>

Hi David,  
"gradle clean" not working. Still having this error.  
and how to run gradle from subdir? cd to benchmarks?

Thank you for your help  
J

---

<div class="post-metadata">

**Author:** ![dadoonet](https://sea2.discourse-cdn.com/elastic/user_avatar/discuss.elastic.co/dadoonet/32/137187_2.png) [@dadoonet](https://discuss.elastic.co/u/dadoonet)\
**Post date:** [March 15, 2017, 11:19am UTC](https://discuss.elastic.co/t/thirdpartyaudit-failed-when-gradle-check/78488/4 "2017-03-15T11:19:36Z")

</div>

So you did not cd. Ok then that's weird.

I have no idea TBH.

Was having similar issues at some point but then I ran gradle clean check from the root dir and it worked.

---

<div class="post-metadata">

**Author:** ![ywelsch](https://sea2.discourse-cdn.com/elastic/user_avatar/discuss.elastic.co/ywelsch/32/7751_2.png) [@ywelsch](https://discuss.elastic.co/u/ywelsch)\
**Post date:** [March 17, 2017, 9:02am UTC](https://discuss.elastic.co/t/thirdpartyaudit-failed-when-gradle-check/78488/5 "2017-03-17T09:02:43Z")

</div>

Will be fixed by [https://github.com/elastic/elasticsearch/pull/23612](https://github.com/elastic/elasticsearch/pull/23612)

---

<div class="post-metadata">

**Author:** ![dadoonet](https://sea2.discourse-cdn.com/elastic/user_avatar/discuss.elastic.co/dadoonet/32/137187_2.png) [@dadoonet](https://discuss.elastic.co/u/dadoonet)\
**Post date:** [March 17, 2017, 9:31am UTC](https://discuss.elastic.co/t/thirdpartyaudit-failed-when-gradle-check/78488/6 "2017-03-17T09:31:18Z")

</div>

Thank you so much Yannick !

---

<div class="post-metadata">

**Author:** ![system](https://us1.discourse-cdn.com/elastic/original/3X/1/a/1ac57faf039f6b580b3f104ef42a2a89e41014de.png) [@system](https://discuss.elastic.co/u/system)\
**Post date:** [April 14, 2017, 9:31am UTC](https://discuss.elastic.co/t/thirdpartyaudit-failed-when-gradle-check/78488/7 "2017-04-14T09:31:22Z")

</div>

This topic was automatically closed 28 days after the last reply. New replies are no longer allowed.
